BDBM50142186 CHEMBL3760091
SMILES Cc1ccc(cc1)-c1ncc(NCC2CCCNC2)cc1-c1ccc(cc1)C#N
InChI Key InChIKey=IWDLSIOISOWIID-UHFFFAOYSA-N
Data  1 KI
  Tab Delimited (TSV)   2D SDfile   Computed 3D by Vconf -m prep SDfile
Find this compound or compounds like it in BindingDB:
Activity Spreadsheet -- Enzyme Inhibition Constant Data from BindingDB
Found 1 hit for monomerid = 50142186
TargetLysine-specific histone demethylase 1A(Homo sapiens (Human))
Baylor College Of Medicine
Curated by ChEMBL
LigandPNGBDBM50142186(CHEMBL3760091)
Affinity DataKi:  1.20E+3nM. Assay description: Inhibition of recombinant human GST-tagged LSD1 catalytic domain (172 to 833 residues) using dimethylated H3K4 peptide substrate preincubated for 10 ...
In DepthDetails ArticlePubMed