BDBM50142306 1,1-Dioxo-1,2,3,4,6,7-hexahydro-5,8-dioxa-1lambda*6*-thia-2-aza-anthracene-3-carboxylic acid [(S)-2-(2-benzenesulfonylamino-ethylcarbamoyl)-1-benzyl-2-oxo-ethyl]-amide::CHEMBL8686
SMILES O=C(N[C@@H](Cc1ccccc1)C(=O)C(=O)NCCNS(=O)(=O)c1ccccc1)C1Cc2cc3OCCOc3cc2S(=O)(=O)N1
InChI Key InChIKey=WIPYZVWMYZARKZ-NQCNTLBGSA-N
Data  1 IC50
  Tab Delimited (TSV)   2D SDfile   Computed 3D by Vconf -m prep SDfile
Find this compound or compounds like it in BindingDB:
Activity Spreadsheet -- Enzyme Inhibition Constant Data from BindingDB
Found 1 hit for monomerid = 50142306
TargetCalpain-1 catalytic subunit(Homo sapiens (Human))
Cephalon
Curated by ChEMBL
LigandPNGBDBM50142306(1,1-Dioxo-1,2,3,4,6,7-hexahydro-5,8-dioxa-1lambda*...)
Affinity DataIC50:  76nM. Assay description: In vitro inhibitory activity against recombinant human calpain 1
In DepthDetails ArticlePubMed