BDBM50142488 7-((S)-2-((R)-3-hydroxy-4-(3-(trifluoromethyl)phenyl)butyl)-5-oxopyrrolidin-1-yl)heptanoic acid::7-{(S)-2-[(R)-3-Hydroxy-4-(3-trifluoromethyl-phenyl)-butyl]-5-oxo-pyrrolidin-1-yl}-heptanoic acid::CHEMBL46395
SMILES O[C@H](CC[C@H]1CCC(=O)N1CCCCCCC(O)=O)Cc1cccc(c1)C(F)(F)F
InChI Key InChIKey=BGIIQHLOAQSIFC-RBUKOAKNSA-N
Data  3 KI  2 IC50  2 EC50
  Tab Delimited (TSV)   2D SDfile   Computed 3D by Vconf -m prep SDfile
Find this compound or compounds like it in BindingDB:
Activity Spreadsheet -- Enzyme Inhibition Constant Data from BindingDB
Found 7 hits for monomerid = 50142488
TargetProstaglandin E2 receptor EP4 subtype(Homo sapiens (Human))
Roche Palo Alto
Curated by ChEMBL
LigandPNGBDBM50142488(7-((S)-2-((R)-3-hydroxy-4-(3-(trifluoromethyl)phen...)
Affinity DataKi:  16nM. Assay description: Binding affinity was determined against prostanoid EP4 receptor
In DepthDetails ArticlePubMed
TargetProstaglandin E2 receptor EP2 subtype(Homo sapiens (Human))
Roche Palo Alto
Curated by ChEMBL
LigandPNGBDBM50142488(7-((S)-2-((R)-3-hydroxy-4-(3-(trifluoromethyl)phen...)
Affinity DataKi:  2.20E+4nM. Assay description: Binding affinity was determined against prostanoid EP2 receptor
In DepthDetails ArticlePubMed
TargetProstaglandin E2 receptor EP3 subtype(Homo sapiens (Human))
Roche Palo Alto
Curated by ChEMBL
LigandPNGBDBM50142488(7-((S)-2-((R)-3-hydroxy-4-(3-(trifluoromethyl)phen...)
Affinity DataKi:  3.80E+4nM. Assay description: Binding affinity was determined against prostanoid EP3 receptor
In DepthDetails ArticlePubMed
TargetProstaglandin E2 receptor EP2 subtype(Rattus norvegicus)
Pfizer
Curated by ChEMBL
LigandPNGBDBM50142488(7-((S)-2-((R)-3-hydroxy-4-(3-(trifluoromethyl)phen...)
Affinity DataIC50: >3.20E+3nM. Assay description: Binding affinity to rat EP2 receptor expressed in HEK293 cells
In DepthDetails ArticlePubMed
TargetProstaglandin E2 receptor EP4 subtype(Rattus norvegicus)
Pfizer
Curated by ChEMBL
LigandPNGBDBM50142488(7-((S)-2-((R)-3-hydroxy-4-(3-(trifluoromethyl)phen...)
Affinity DataIC50:  21nM. Assay description: Binding affinity to rat EP4 receptor expressed in HEK293 cells
In DepthDetails ArticlePubMed
TargetProstaglandin E2 receptor EP4 subtype(Homo sapiens (Human))
Roche Palo Alto
Curated by ChEMBL
LigandPNGBDBM50142488(7-((S)-2-((R)-3-hydroxy-4-(3-(trifluoromethyl)phen...)
Affinity DataEC50:  460nM. Assay description: Agonist activity against recombinant prostanoid EP4 receptor stably transfected in CHO cells
In DepthDetails ArticlePubMed
TargetProstaglandin E2 receptor EP4 subtype(Rattus norvegicus)
Pfizer
Curated by ChEMBL
LigandPNGBDBM50142488(7-((S)-2-((R)-3-hydroxy-4-(3-(trifluoromethyl)phen...)
Affinity DataEC50:  13nM. Assay description: Activity at rat EP4 transfected in HEK293 cells by cAMP accumulation
In DepthDetails ArticlePubMed