BDBM50142491 7-{(R)-2-[(E)-3-Hydroxy-4-(3-trifluoromethyl-phenyl)-but-1-enyl]-5-oxo-pyrrolidin-1-yl}-heptanoic acid::CHEMBL440474
SMILES OC(Cc1cccc(c1)C(F)(F)F)\C=C\[C@H]1CCC(=O)N1CCCCCCC(O)=O
InChI Key InChIKey=BODQJJXRLLGDOE-WZUSVKQHSA-N
Data  2 KI  1 EC50
  Tab Delimited (TSV)   2D SDfile   Computed 3D by Vconf -m prep SDfile
Find this compound or compounds like it in BindingDB:
Activity Spreadsheet -- Enzyme Inhibition Constant Data from BindingDB
Found 3 hits for monomerid = 50142491
TargetProstaglandin E2 receptor EP3 subtype(Homo sapiens (Human))
Roche Palo Alto
Curated by ChEMBL
LigandPNGBDBM50142491(7-{(R)-2-[(E)-3-Hydroxy-4-(3-trifluoromethyl-pheny...)
Affinity DataKi:  1.20E+4nM. Assay description: Binding affinity was determined against prostanoid EP3 receptor
In DepthDetails ArticlePubMed
TargetProstaglandin E2 receptor EP1 subtype(Homo sapiens (Human))
Roche Palo Alto
Curated by ChEMBL
LigandPNGBDBM50142491(7-{(R)-2-[(E)-3-Hydroxy-4-(3-trifluoromethyl-pheny...)
Affinity DataKi: >1.00E+5nM. Assay description: Binding affinity was determined against prostanoid EP1 receptor
In DepthDetails ArticlePubMed
TargetProstaglandin E2 receptor EP4 subtype(Homo sapiens (Human))
Roche Palo Alto
Curated by ChEMBL
LigandPNGBDBM50142491(7-{(R)-2-[(E)-3-Hydroxy-4-(3-trifluoromethyl-pheny...)
Affinity DataEC50:  17nM. Assay description: Agonist activity against recombinant prostanoid EP4 receptor stably transfected in CHO cells
In DepthDetails ArticlePubMed