BDBM50142546 (Z)-5-(1,5-Dimethyl-hexyl)-6,10-dimethyl-13-oxo-tricyclo[13.2.2.0*2,6*]nonadeca-1(17),9,15,18-tetraene-17-carboxylic acid::CHEMBL47989
SMILES CC(C)CCC[C@@H](C)[C@H]1CC[C@H]2c3ccc(CC(=O)CC\C(C)=C/CC[C@]12C)cc3C(O)=O
InChI Key InChIKey=CHSUASFCRFONQW-YEGBQVPISA-N
Data  1 IC50
  Tab Delimited (TSV)   2D SDfile   Computed 3D by Vconf -m prep SDfile
Find this compound or compounds like it in BindingDB:
Activity Spreadsheet -- Enzyme Inhibition Constant Data from BindingDB
Found 1 hit for monomerid = 50142546
TargetM-phase inducer phosphatase 2(Homo sapiens (Human))
Schering
Curated by ChEMBL
LigandPNGBDBM50142546((Z)-5-(1,5-Dimethyl-hexyl)-6,10-dimethyl-13-oxo-tr...)
Affinity DataIC50:  8.50E+3nM. Assay description: Inhibitory concentration to human cell division cycle 25B (Cdc25B)
In DepthDetails ArticlePubMed