BDBM50142559 (Z)-5-(1,5-Dimethyl-hexyl)-6,10-dimethyl-13-phenoxy-tricyclo[13.2.2.0*2,6*]nonadeca-1(17),9,15,18-tetraene-17-carboxylic acid::CHEMBL416275
SMILES CC(C)CCC[C@@H](C)[C@H]1CC[C@H]2c3ccc(C[C@@H](CC\C(C)=C/CC[C@]12C)Oc1ccccc1)cc3C(O)=O
InChI Key InChIKey=VVUCIXDRULNGRD-ZARZTCTQSA-N
Data  1 IC50
  Tab Delimited (TSV)   2D SDfile   Computed 3D by Vconf -m prep SDfile
Find this compound or compounds like it in BindingDB:
Activity Spreadsheet -- Enzyme Inhibition Constant Data from BindingDB
Found 1 hit for monomerid = 50142559
TargetM-phase inducer phosphatase 2(Homo sapiens (Human))
Schering
Curated by ChEMBL
LigandPNGBDBM50142559((Z)-5-(1,5-Dimethyl-hexyl)-6,10-dimethyl-13-phenox...)
Affinity DataIC50:  7.10E+3nM. Assay description: Inhibitory concentration to human cell division cycle 25B (Cdc25B)
In DepthDetails ArticlePubMed