BDBM50142561 11-(3,5-Dimethyl-isoxazol-4-yl)-9-(4-methyl-thiazol-2-yl)-6,7-dihydro-5H-2,7a-diaza-dibenzo[a,c]cyclohepten-8-one::CHEMBL44320
SMILES Cc1csc(n1)-c1cc(-c2c(C)noc2C)c2-c3cnccc3CCCn2c1=O
InChI Key InChIKey=JTGPXCIJDIEQSX-UHFFFAOYSA-N
Data  2 KI
  Tab Delimited (TSV)   2D SDfile   Computed 3D by Vconf -m prep SDfile
Find this compound or compounds like it in BindingDB:
Activity Spreadsheet -- Enzyme Inhibition Constant Data from BindingDB
Found 2 hits for monomerid = 50142561
TargetGamma-aminobutyric acid receptor subunit alpha-3/beta-3/gamma-2(Homo sapiens (Human))
The Neuroscience Research Centre
Curated by ChEMBL
LigandPNGBDBM50142561(11-(3,5-Dimethyl-isoxazol-4-yl)-9-(4-methyl-thiazo...)
Affinity DataKi:  3.10nM. Assay description: Binding affinity at human recombinant gamma-aminobutyric-acid A receptor alpha1-beta3-gamma2 expressed in L(tk) cells by [3H]-Ro-15-1788 displacement...
In DepthDetails ArticlePubMed
TargetGamma-aminobutyric acid receptor subunit alpha-1/beta-3/gamma-2(Homo sapiens (Human))
The Neuroscience Research Centre
Curated by ChEMBL
LigandPNGBDBM50142561(11-(3,5-Dimethyl-isoxazol-4-yl)-9-(4-methyl-thiazo...)
Affinity DataKi:  4.60nM. Assay description: Binding affinity at human recombinant gamma-aminobutyric-acid A receptor alpha1-beta3-gamma2 expressed in L(tk) cells by [3H]-Ro-15-1788 displacement...
In DepthDetails ArticlePubMed