BDBM50142654 2-{(S)-3-[3'-(1-Butyl-3-methyl-ureidomethyl)-biphenyl-4-ylmethyl]-4-methyl-2,5-dioxo-piperazin-1-yl}-N-pentyl-acetamide::CHEMBL45770
SMILES CCCCCNC(=O)CN1CC(=O)N(C)[C@@H](Cc2ccc(cc2)-c2cccc(CN(CCCC)C(=O)NC)c2)C1=O
InChI Key InChIKey=RNFLMJPUDFNJDQ-NDEPHWFRSA-N
Data  2 EC50
  Tab Delimited (TSV)   2D SDfile   Computed 3D by Vconf -m prep SDfile
Find this compound or compounds like it in BindingDB:
Activity Spreadsheet -- Enzyme Inhibition Constant Data from BindingDB
Found 2 hits for monomerid = 50142654
TargetFollicle-stimulating hormone receptor(Homo sapiens (Human))
Pharmacopeia
Curated by ChEMBL
LigandPNGBDBM50142654(2-{(S)-3-[3'-(1-Butyl-3-methyl-ureidomethyl)-biphe...)
Affinity DataEC50:  1.70nM. Assay description: Agonistic activity against human follicle stimulating hormone receptor in CHO-hFSHR-luciferase assay.
In DepthDetails ArticlePubMed
TargetFollicle-stimulating hormone receptor(Homo sapiens (Human))
Pharmacopeia
Curated by ChEMBL
LigandPNGBDBM50142654(2-{(S)-3-[3'-(1-Butyl-3-methyl-ureidomethyl)-biphe...)
Affinity DataEC50:  1.70E+3nM. Assay description: Agonistic activity against Follicle stimulating hormone receptor expressed in chinese hamster ovary cells(CHO)
In DepthDetails ArticlePubMed