BDBM50142815 4-[1'-(1H-Benzoimidazole-4-carbonyl)-[1,4']bipiperidinyl-4-ylmethyl]-N-isopropyl-benzamide::CHEMBL53965
SMILES CC(C)NC(=O)c1ccc(CC2CCN(CC2)C2CCN(CC2)C(=O)c2cccc3nc[nH]c23)cc1
InChI Key InChIKey=SJAZZRHNMWEHRA-UHFFFAOYSA-N
Data  1 KI
  Tab Delimited (TSV)   2D SDfile   Computed 3D by Vconf -m prep SDfile
Find this compound or compounds like it in BindingDB:
Activity Spreadsheet -- Enzyme Inhibition Constant Data from BindingDB
Found 1 hit for monomerid = 50142815
TargetMuscarinic acetylcholine receptor M2(Homo sapiens (Human))
Schering-Plough Research Institute
Curated by ChEMBL
LigandPNGBDBM50142815(4-[1'-(1H-Benzoimidazole-4-carbonyl)-[1,4']bipiper...)
Affinity DataKi:  27nM. Assay description: Binding affinity against cloned human muscarinic acetylcholine receptor M2.
In DepthDetails ArticlePubMed