BDBM50142888 CHEMBL3759278
SMILES COc1cc2ncnc(Nc3ccccc3Cl)c2cc1OCCCC(=O)NO
InChI Key InChIKey=WSXRWOYSPXHMBD-UHFFFAOYSA-N
Data  2 IC50
  Tab Delimited (TSV)   2D SDfile   Computed 3D by Vconf -m prep SDfile
Find this compound or compounds like it in BindingDB:
Activity Spreadsheet -- Enzyme Inhibition Constant Data from BindingDB
Found 2 hits for monomerid = 50142888
TargetHistone deacetylase(Homo sapiens (Human))
China Pharmaceutical University
Curated by ChEMBL
LigandPNGBDBM50142888(CHEMBL3759278)
Affinity DataIC50:  1.26E+3nM. Assay description: Inhibition of HDAC in human HeLa cell nuclear extracts preincubated for 15 mins followed by addition of Fluor de Lys as substrate for 1 hr by fluorom...
In DepthDetails ArticlePubMed
TargetVascular endothelial growth factor receptor 2(Homo sapiens (Human))
China Pharmaceutical University
Curated by ChEMBL
LigandPNGBDBM50142888(CHEMBL3759278)
Affinity DataIC50:  857nM. Assay description: Inhibition of VEGFR2 (unknown origin) preincubated for 5 mins followed by addition of ATP/gastrin precursor(Tyr87) biotinylated peptide cocktail incu...
In DepthDetails ArticlePubMed