BDBM50142892 2-[2-(2,6-Difluoro-benzylsulfanyl)-phenyl]-1,4,5,6-tetrahydro-pyrimidine::CHEMBL289532
SMILES Fc1cccc(F)c1CSc1ccccc1C1=NCCCN1
InChI Key InChIKey=IIXSESNTPZDVOB-UHFFFAOYSA-N
Data  1 KI
  Tab Delimited (TSV)   2D SDfile   Computed 3D by Vconf -m prep SDfile
Find this compound or compounds like it in BindingDB:
Activity Spreadsheet -- Enzyme Inhibition Constant Data from BindingDB
Found 1 hit for monomerid = 50142892
TargetMelanocortin receptor 4(Mus musculus)
Millennium Pharmaceuticals
Curated by ChEMBL
LigandPNGBDBM50142892(2-[2-(2,6-Difluoro-benzylsulfanyl)-phenyl]-1,4,5,6...)
Affinity DataKi:  1.58E+4nM. Assay description: Antagonistic activity of the compound was determined against mice melanocortin 4 receptor using [125I]-[NDP]-R-MSH as radioligand in a membranefiltra...
In DepthDetails ArticlePubMed