BDBM50142909 CHEMBL3759928
SMILES CO[C@@H]1CN(CCC(=O)N2CCC(Cc3ccccc3)CC2)CC[C@@H]1NC(=O)c1cc(Cl)c(N)cc1OC
InChI Key InChIKey=ZTQQPPORKRCKLL-AHKZPQOWSA-N
Data  2 IC50  1 EC50
  Tab Delimited (TSV)   2D SDfile   Computed 3D by Vconf -m prep SDfile
Find this compound or compounds like it in BindingDB:
Activity Spreadsheet -- Enzyme Inhibition Constant Data from BindingDB
Found 3 hits for monomerid = 50142909
TargetPotassium voltage-gated channel subfamily H member 2(Homo sapiens (Human))
Sungkyunkwan University
Curated by ChEMBL
LigandPNGBDBM50142909(CHEMBL3759928)
Affinity DataIC50:  3.70E+3nM. Assay description: Inhibition of human ERG channel by fluorescence polarization assay
In DepthDetails ArticlePubMed
Target5-hydroxytryptamine receptor 4(Homo sapiens (Human))
Sungkyunkwan University
Curated by ChEMBL
LigandPNGBDBM50142909(CHEMBL3759928)
Affinity DataIC50:  66nM. Assay description: Displacement of [3H]-GR113808 from human 5-HT4 receptor expressed in African green monkey COS7 cell membranes after 30 mins by liquid scintillation c...
In DepthDetails ArticlePubMed
Target5-hydroxytryptamine receptor 4(RAT)
Sungkyunkwan University
Curated by ChEMBL
LigandPNGBDBM50142909(CHEMBL3759928)
Affinity DataEC50:  6.03E+3nM. Assay description: Agonist activity at 5-HT4 receptor in rat esophageal thoracic muscularis mucosae assessed as carbachol-induced contraction
In DepthDetails ArticlePubMed