BDBM50143044 CHEMBL3758197
SMILES CC(C)Cn1c(COc2ccc(CC3SC(=O)NC3=O)cc2)nc2ccccc12
InChI Key InChIKey=ZZESAIGPDOBLKZ-UHFFFAOYSA-N
Data  2 EC50
  Tab Delimited (TSV)   2D SDfile   Computed 3D by Vconf -m prep SDfile
Find this compound or compounds like it in BindingDB:
Activity Spreadsheet -- Enzyme Inhibition Constant Data from BindingDB
Found 2 hits for monomerid = 50143044
TargetPeroxisome proliferator-activated receptor alpha(Homo sapiens (Human))
Suez Canal University
Curated by ChEMBL
LigandPNGBDBM50143044(CHEMBL3758197)
Affinity DataEC50:  1.32E+4nM. Assay description: Transactivation of N-terminal Gal4 DNA binding domain-linked human PPARalpha ligand binding domain after 24 hrs by luciferase reporter gene assay rel...
In DepthDetails ArticlePubMed
TargetFree fatty acid receptor 1(Homo sapiens (Human))
Suez Canal University
Curated by ChEMBL
LigandPNGBDBM50143044(CHEMBL3758197)
Affinity DataEC50:  1.89E+3nM. Assay description: Agonist activity at human FFAR1 expressed in CHO-K1 cells assessed as calcium flux measured for 100 secs by FLIPR assay
In DepthDetails ArticlePubMed