BDBM50143160 CHEMBL3759573
SMILES Cc1scnc1C(=O)Nc1ccc(N2C(=O)c3cccnc3C2=O)c(Cl)c1
InChI Key InChIKey=UFCNJVJACAZTTK-UHFFFAOYSA-N
Data  3 EC50
  Tab Delimited (TSV)   2D SDfile   Computed 3D by Vconf -m prep SDfile
Find this compound or compounds like it in BindingDB:
Activity Spreadsheet -- Enzyme Inhibition Constant Data from BindingDB
Found 3 hits for monomerid = 50143160
TargetMetabotropic glutamate receptor 1(Homo sapiens (Human))
Vanderbilt University Medical Center
Curated by ChEMBL
LigandPNGBDBM50143160(CHEMBL3759573)
Affinity DataEC50:  191nM. Assay description: Positive allosteric modulation of human mGlu1 receptor by cell based calcium mobilization
In DepthDetails ArticlePubMed
TargetMetabotropic glutamate receptor 4(Homo sapiens (Human))
Vanderbilt University Medical Center
Curated by ChEMBL
LigandPNGBDBM50143160(CHEMBL3759573)
Affinity DataEC50: >1.00E+4nM. Assay description: Positive allosteric modulation of human mGlu4 receptor by cell based calcium mobilization
In DepthDetails ArticlePubMed
TargetMetabotropic glutamate receptor 1(Homo sapiens (Human))
Vanderbilt University Medical Center
Curated by ChEMBL
LigandPNGBDBM50143160(CHEMBL3759573)
Affinity DataEC50:  191nM. Assay description: Positive allosteric modulation of human mGlu1 receptor by cell based calcium mobilization
In DepthDetails ArticlePubMed