BDBM50143187 CHEMBL1481051
SMILES Cc1n[nH]c2NC(=O)CC(c12)c1ccccc1F
InChI Key InChIKey=LRUBLHAUBIRNHW-UHFFFAOYSA-N
Data  1 IC50
  Tab Delimited (TSV)   2D SDfile   Computed 3D by Vconf -m prep SDfile
Find this compound or compounds like it in BindingDB:
Activity Spreadsheet -- Enzyme Inhibition Constant Data from BindingDB
Found 1 hit for monomerid = 50143187
TargetDNA gyrase subunit B(Staphylococcus aureus)
Cubist Pharmaceuticals
Curated by ChEMBL
LigandPNGBDBM50143187(CHEMBL1481051)
Affinity DataIC50:  8.40E+5nM. Assay description: Binding affinity to full length Staphylococcus aureus GyrB by STD-NMR spectroscopic analysis
In DepthDetails ArticlePubMed