BDBM50143406 CHEMBL3759889
SMILES CC(C)n1nc(cc1-c1ccc(F)cc1)C(=O)NCCCCCCS
InChI Key InChIKey=GMXVUACKHBTUKY-UHFFFAOYSA-N
Data  3 IC50
  Tab Delimited (TSV)   2D SDfile   Computed 3D by Vconf -m prep SDfile
Find this compound or compounds like it in BindingDB:
Activity Spreadsheet -- Enzyme Inhibition Constant Data from BindingDB
Found 3 hits for monomerid = 50143406
TargetHistone deacetylase 6(Homo sapiens (Human))
Shenyang Pharmaceutical University
Curated by ChEMBL
LigandPNGBDBM50143406(CHEMBL3759889)
Affinity DataIC50: >1.00E+4nM. Assay description: Inhibition of recombinant human HDAC6
In DepthDetails ArticlePubMed
TargetHistone deacetylase(Homo sapiens (Human))
Shenyang Pharmaceutical University
Curated by ChEMBL
LigandPNGBDBM50143406(CHEMBL3759889)
Affinity DataIC50: >1.00E+4nM. Assay description: Inhibition of HDAC in human HeLa nuclear extract
In DepthDetails ArticlePubMed
TargetHistone deacetylase 1(Homo sapiens (Human))
Shenyang Pharmaceutical University
Curated by ChEMBL
LigandPNGBDBM50143406(CHEMBL3759889)
Affinity DataIC50: >1.00E+4nM. Assay description: Inhibition of recombinant human HDAC1
In DepthDetails ArticlePubMed