BDBM50143516 (1S,4R)-3-(4-Ethoxycarbonyl-phenylcarbamoyl)-7-oxa-bicyclo[2.2.1]heptane-2-carboxylic acid::CHEMBL425851
SMILES CCOC(=O)c1ccc(NC(=O)C2[C@H]3CC[C@H](O3)C2C(O)=O)cc1
InChI Key InChIKey=ANSRIYMZFWTOQT-KBHBFKLGSA-N
Data  1 IC50
  Tab Delimited (TSV)   2D SDfile   Computed 3D by Vconf -m prep SDfile
Find this compound or compounds like it in BindingDB:
Activity Spreadsheet -- Enzyme Inhibition Constant Data from BindingDB
Found 1 hit for monomerid = 50143516
TargetProtein phosphatase 1B(Homo sapiens (Human))
University Of California Irvine
Curated by ChEMBL
LigandPNGBDBM50143516((1S,4R)-3-(4-Ethoxycarbonyl-phenylcarbamoyl)-7-oxa...)
Affinity DataIC50:  2.90E+4nM. Assay description: Inhibitory activity against protein phosphatase-1 from rabbit skeletal muscle
In DepthDetails ArticlePubMed