BDBM50143648 5-((E)-2-Quinolin-2-yl-vinyl)-naphthalene-2-carboxylic acid::CHEMBL57561
SMILES OC(=O)c1ccc2c(\C=C\c3ccc4ccccc4n3)cccc2c1
InChI Key InChIKey=KGJVOWMNLZZKMF-DHZHZOJOSA-N
Data  1 IC50
  Tab Delimited (TSV)   2D SDfile   Computed 3D by Vconf -m prep SDfile
Find this compound or compounds like it in BindingDB:
Activity Spreadsheet -- Enzyme Inhibition Constant Data from BindingDB
Found 1 hit for monomerid = 50143648
TargetCapsid scaffolding protein(Human cytomegalovirus (strain AD169) (HHV-5) (Huma...)
Wyeth Research
Curated by ChEMBL
LigandPNGBDBM50143648(5-((E)-2-Quinolin-2-yl-vinyl)-naphthalene-2-carbox...)
Affinity DataIC50: >50nM. Assay description: Inhibitory concentration against HCMV protease.
In DepthDetails ArticlePubMed