BDBM50143662 8-{2-[4-(2-Methoxy-phenyl)-piperazin-1-yl]-ethyl}-8-aza-spiro[4.5]dec-9-en-7-one::CHEMBL57540
SMILES COc1ccccc1N1CCN(CCN2C=CC3(CCCC3)CC2=O)CC1
InChI Key InChIKey=NMZPGTCGQWMZBC-UHFFFAOYSA-N
Data  6 KI
  Tab Delimited (TSV)   2D SDfile   Computed 3D by Vconf -m prep SDfile
Find this compound or compounds like it in BindingDB:
Activity Spreadsheet -- Enzyme Inhibition Constant Data from BindingDB
Found 6 hits for monomerid = 50143662
TargetAlpha-1D adrenergic receptor(Rattus norvegicus (Rat))
Recordati
Curated by ChEMBL
LigandPNGBDBM50143662(8-{2-[4-(2-Methoxy-phenyl)-piperazin-1-yl]-ethyl}-...)
Affinity DataKi:  3.15nM. Assay description: Binding affinity to the adrenergic receptor alpha-1D of rat aorta
In DepthDetails ArticlePubMed
Target5-hydroxytryptamine receptor 1A(Homo sapiens (Human))
Recordati
Curated by ChEMBL
LigandPNGBDBM50143662(8-{2-[4-(2-Methoxy-phenyl)-piperazin-1-yl]-ethyl}-...)
Affinity DataKi:  3.84nM. Assay description: Binding affinity to human 5-hydroxytryptamine 1A receptor was measured using [3H]-8-hydroxy-2-(di-n-propylamine) tetraline [3H]-8-OH-DPAT) as radioli...
In DepthDetails ArticlePubMed
TargetAlpha-1A adrenergic receptor(Homo sapiens (Human))TBA
LigandPNGBDBM50143662(8-{2-[4-(2-Methoxy-phenyl)-piperazin-1-yl]-ethyl}-...)
Affinity DataKi:  23nM. Assay description: Binding affinity to adrenergic alpha1A receptor (unknown origin)
In DepthDetails Article
TargetAlpha-1A adrenergic receptor(Homo sapiens (Human))TBA
LigandPNGBDBM50143662(8-{2-[4-(2-Methoxy-phenyl)-piperazin-1-yl]-ethyl}-...)
Affinity DataKi:  23nM. Assay description: Binding affinity to adrenergic alpha1A receptor (unknown origin)
In DepthDetails Article
TargetAlpha-1A adrenergic receptor(Rattus norvegicus (Rat))
Recordati
Curated by ChEMBL
LigandPNGBDBM50143662(8-{2-[4-(2-Methoxy-phenyl)-piperazin-1-yl]-ethyl}-...)
Affinity DataKi:  29.3nM. Assay description: In vitro binding affinity towards alpha-1A adrenergic receptor through displacement of [3H]-prazosin in epididymal rat vas deferens.
In DepthDetails ArticlePubMed
TargetAlpha-1B adrenergic receptor(Homo sapiens (Human))
Recordati
Curated by ChEMBL
LigandPNGBDBM50143662(8-{2-[4-(2-Methoxy-phenyl)-piperazin-1-yl]-ethyl}-...)
Affinity DataKi:  132nM. Assay description: Binding affinity constant against alpha-1B adrenergic receptor of guinea pig spleen
In DepthDetails ArticlePubMed