BDBM50143682 8-{3-[4-(2,5-Dichloro-phenyl)-piperazin-1-yl]-propyl}-8-aza-spiro[4.5]decane-7,9-dione::CHEMBL55319
SMILES Clc1ccc(Cl)c(c1)N1CCN(CCCN2C(=O)CC3(CCCC3)CC2=O)CC1
InChI Key InChIKey=SYPZJTHVWQUCJS-UHFFFAOYSA-N
Data  4 KI
  Tab Delimited (TSV)   2D SDfile   Computed 3D by Vconf -m prep SDfile
Find this compound or compounds like it in BindingDB:
Activity Spreadsheet -- Enzyme Inhibition Constant Data from BindingDB
Found 4 hits for monomerid = 50143682
TargetAlpha-1D adrenergic receptor(Rattus norvegicus (Rat))
Recordati
Curated by ChEMBL
LigandPNGBDBM50143682(8-{3-[4-(2,5-Dichloro-phenyl)-piperazin-1-yl]-prop...)
Affinity DataKi:  1.72nM. Assay description: Binding affinity to the adrenergic receptor alpha-1D of rat aorta
In DepthDetails ArticlePubMed
TargetAlpha-1A adrenergic receptor(Rattus norvegicus (Rat))
Recordati
Curated by ChEMBL
LigandPNGBDBM50143682(8-{3-[4-(2,5-Dichloro-phenyl)-piperazin-1-yl]-prop...)
Affinity DataKi:  2.85nM. Assay description: In vitro binding affinity towards alpha-1A adrenergic receptor through displacement of [3H]-prazosin in epididymal rat vas deferens.
In DepthDetails ArticlePubMed
TargetAlpha-1B adrenergic receptor(Homo sapiens (Human))
Recordati
Curated by ChEMBL
LigandPNGBDBM50143682(8-{3-[4-(2,5-Dichloro-phenyl)-piperazin-1-yl]-prop...)
Affinity DataKi:  13.6nM. Assay description: Binding affinity constant against alpha-1B adrenergic receptor of guinea pig spleen
In DepthDetails ArticlePubMed
Target5-hydroxytryptamine receptor 1A(Homo sapiens (Human))
Recordati
Curated by ChEMBL
LigandPNGBDBM50143682(8-{3-[4-(2,5-Dichloro-phenyl)-piperazin-1-yl]-prop...)
Affinity DataKi:  401nM. Assay description: Binding affinity to human 5-hydroxytryptamine 1A receptor was measured using [3H]-8-hydroxy-2-(di-n-propylamine) tetraline [3H]-8-OH-DPAT) as radioli...
In DepthDetails ArticlePubMed