BDBM50143793 3-(3,4-Dimethyl-isoxazol-5-ylsulfamoyl)-thiophene-2-carboxylic acid (2-acetyl-4,6-dimethyl-phenyl)-amide::CHEMBL432521
SMILES CC(=O)c1cc(C)cc(C)c1NC(=O)c1sccc1S(=O)(=O)Nc1onc(C)c1C
InChI Key InChIKey=IAYNHDZSSDUYHY-UHFFFAOYSA-N
Data  1 IC50
  Tab Delimited (TSV)   2D SDfile   Computed 3D by Vconf -m prep SDfile
Find this compound or compounds like it in BindingDB:
Activity Spreadsheet -- Enzyme Inhibition Constant Data from BindingDB
Found 1 hit for monomerid = 50143793
TargetEndothelin-1 receptor(RAT)
Encysive Pharmaceuticals
Curated by ChEMBL
LigandPNGBDBM50143793(3-(3,4-Dimethyl-isoxazol-5-ylsulfamoyl)-thiophene-...)
Affinity DataIC50:  0.0800nM. Assay description: Inhibitory concentration towards endothelin A receptor in rat.
In DepthDetails ArticlePubMed