BDBM50143822 CHEMBL3759291
SMILES CC(C)(C)c1nc(NC(=O)C(C)(C)NC(=O)C2(C)CC2)nn1-c1ccc(F)cc1
InChI Key InChIKey=XCKXIXPSSYFKAF-UHFFFAOYSA-N
Data  1 IC50
  Tab Delimited (TSV)   2D SDfile   Computed 3D by Vconf -m prep SDfile
Find this compound or compounds like it in BindingDB:
Activity Spreadsheet -- Enzyme Inhibition Constant Data from BindingDB
Found 1 hit for monomerid = 50143822
TargetDiacylglycerol O-acyltransferase 1(Homo sapiens (Human))
Novartis Institutes For Biomedical Research
Curated by ChEMBL
LigandPNGBDBM50143822(CHEMBL3759291)
Affinity DataIC50: >1.00E+4nM. Assay description: Inhibition of human recombinant 6His-tagged DAGT1 expressed in fall armyworm Sf9 cells using diolein and oleoyl-CoA incubated for 30 mins by LC/MS/MS...
In DepthDetails ArticlePubMed