BDBM50143840 (S)-5-[2-(4-Carbamimidoyl-phenyl)-1-oxo-2,8-diaza-spiro[4.5]dec-8-yl]-3-methyl-5-oxo-pentanoic acid::CHEMBL62639
SMILES C[C@H](CC(O)=O)CC(=O)N1CCC2(CCN(C2=O)c2ccc(cc2)C(N)=N)CC1
InChI Key InChIKey=UKLBLFWTHWVCSP-AWEZNQCLSA-N
Data  2 IC50
  Tab Delimited (TSV)   2D SDfile   Computed 3D by Vconf -m prep SDfile
Find this compound or compounds like it in BindingDB:
Activity Spreadsheet -- Enzyme Inhibition Constant Data from BindingDB
Found 2 hits for monomerid = 50143840
TargetIntegrin alpha-IIb/beta-3(Homo sapiens (Human))
Millennium Pharmaceuticals
Curated by ChEMBL
LigandPNGBDBM50143840((S)-5-[2-(4-Carbamimidoyl-phenyl)-1-oxo-2,8-diaza-...)
Affinity DataIC50:  350nM. Assay description: Inhibition of platelet aggregation induced by 20 microM adenosine 5-diphosphate (ADP) in citrated human platelet rich plasma (h-PRP)
In DepthDetails ArticlePubMed
TargetIntegrin alpha-IIb/beta-3(Homo sapiens (Human))
Millennium Pharmaceuticals
Curated by ChEMBL
LigandPNGBDBM50143840((S)-5-[2-(4-Carbamimidoyl-phenyl)-1-oxo-2,8-diaza-...)
Affinity DataIC50:  5nM. Assay description: Tested for inhibition of the binding of fibrinogen to purified human GPIIb-IIIa in a 96-well format (ELISA assay)
In DepthDetails ArticlePubMed