BDBM50144069 (S)-2-(2,6-Dimethyl-benzoylamino)-3-(1H-indol-3-yl)-propionic acid::CHEMBL304905
SMILES Cc1cccc(C)c1C(=O)N[C@@H](Cc1c[nH]c2ccccc12)C(O)=O
InChI Key InChIKey=DEGQRJCTRCTPIT-KRWDZBQOSA-N
Data  1 IC50
  Tab Delimited (TSV)   2D SDfile   Computed 3D by Vconf -m prep SDfile
Find this compound or compounds like it in BindingDB:
Activity Spreadsheet -- Enzyme Inhibition Constant Data from BindingDB
Found 1 hit for monomerid = 50144069
TargetIntegrin alpha-L/Integrin beta-2/Intercellular adhesion molecule 1(Homo sapiens (Human))
Genentech
Curated by ChEMBL
LigandPNGBDBM50144069((S)-2-(2,6-Dimethyl-benzoylamino)-3-(1H-indol-3-yl...)
Affinity DataIC50:  1.10E+3nM. Assay description: Inhibitory activity against association of LFA-1 with intercellular adhesion molecule 1
In DepthDetails ArticlePubMed