BDBM50144190 CHEMBL302396::Propyl-(1-thiophen-2-yl-cyclopropyl)-[4-(2,4,6-trimethoxy-phenyl)-pyrimidin-2-yl]-amine
SMILES CCCN(c1nccc(n1)-c1c(OC)cc(OC)cc1OC)C1(CC1)c1cccs1
InChI Key InChIKey=BBVBVFFELLROLS-UHFFFAOYSA-N
Data  1 KI
  Tab Delimited (TSV)   2D SDfile   Computed 3D by Vconf -m prep SDfile
Find this compound or compounds like it in BindingDB:
Activity Spreadsheet -- Enzyme Inhibition Constant Data from BindingDB
Found 1 hit for monomerid = 50144190
TargetCorticotropin-releasing factor receptor 1(Homo sapiens (Human))
Neurocrine Biosciences
Curated by ChEMBL
LigandPNGBDBM50144190(CHEMBL302396 | Propyl-(1-thiophen-2-yl-cyclopropyl...)
Affinity DataKi:  250nM. Assay description: Binding affinity towards human Corticotropin releasing factor receptor 1 by the displacement of [125I]-CRF from CHO cells
In DepthDetails ArticlePubMed