BDBM50144245 4-[(8-Aza-bicyclo[3.2.1]oct-3-ylidene)-(4-hydroxy-phenyl)-methyl]-N,N-diethyl-benzamide::CHEMBL308928
SMILES [#6]-[#6]-[#7](-[#6]-[#6])-[#6](=O)-c1ccc(cc1)-[#6](=[#6]-1/[#6]-[#6]-2-[#6]-[#6]-[#6](-[#6]-1)-[#7]-2)\c1ccc(-[#8])cc1
InChI Key InChIKey=YFVXEAIWMFQVBV-UHFFFAOYSA-N
Data  2 KI  1 EC50
  Tab Delimited (TSV)   2D SDfile   Computed 3D by Vconf -m prep SDfile
Find this compound or compounds like it in BindingDB:
Activity Spreadsheet -- Enzyme Inhibition Constant Data from BindingDB
Found 3 hits for monomerid = 50144245
TargetDelta-type opioid receptor(Homo sapiens (Human))
Johnson And Johnson Pharmaceutical Research And Development
Curated by ChEMBL
LigandPNGBDBM50144245(4-[(8-Aza-bicyclo[3.2.1]oct-3-ylidene)-(4-hydroxy-...)
Affinity DataKi:  0.580nM. Assay description: Binding affinity for delta opioid receptor
In DepthDetails ArticlePubMed
TargetMu-type opioid receptor(Homo sapiens (Human))
Johnson And Johnson Pharmaceutical Research And Development
Curated by ChEMBL
LigandPNGBDBM50144245(4-[(8-Aza-bicyclo[3.2.1]oct-3-ylidene)-(4-hydroxy-...)
Affinity DataKi:  442nM. Assay description: Binding affinity for mu opioid receptor
In DepthDetails ArticlePubMed
TargetDelta-type opioid receptor(Homo sapiens (Human))
Johnson And Johnson Pharmaceutical Research And Development
Curated by ChEMBL
LigandPNGBDBM50144245(4-[(8-Aza-bicyclo[3.2.1]oct-3-ylidene)-(4-hydroxy-...)
Affinity DataEC50:  5nM. Assay description: Effective concentration against stimulation of [35S]-GTP-gammaS, binding in CHO cells transfected with the human opioid receptor delta 1
In DepthDetails ArticlePubMed