BDBM50144246 4-{[(1R,5S)-8-Allyl-8-aza-bicyclo[3.2.1]oct-(3E)-ylidene]-phenyl-methyl}-N,N-diethyl-benzamide::CHEMBL304989
SMILES CCN(CC)C(=O)c1ccc(cc1)C(=C1/C[C@@H]2CC[C@H](C1)N2CC=C)\c1ccccc1
InChI Key InChIKey=ZCAJUSLEHCCIDZ-XDGQVVELSA-N
Data  2 KI  1 EC50
  Tab Delimited (TSV)   2D SDfile   Computed 3D by Vconf -m prep SDfile
Find this compound or compounds like it in BindingDB:
Activity Spreadsheet -- Enzyme Inhibition Constant Data from BindingDB
Found 3 hits for monomerid = 50144246
TargetDelta-type opioid receptor(Homo sapiens (Human))
Johnson And Johnson Pharmaceutical Research And Development
Curated by ChEMBL
LigandPNGBDBM50144246(4-{[(1R,5S)-8-Allyl-8-aza-bicyclo[3.2.1]oct-(3E)-y...)
Affinity DataKi:  0.320nM. Assay description: Binding affinity for delta opioid receptor
In DepthDetails ArticlePubMed
TargetMu-type opioid receptor(Homo sapiens (Human))
Johnson And Johnson Pharmaceutical Research And Development
Curated by ChEMBL
LigandPNGBDBM50144246(4-{[(1R,5S)-8-Allyl-8-aza-bicyclo[3.2.1]oct-(3E)-y...)
Affinity DataKi:  4.40E+3nM. Assay description: Binding affinity for mu opioid receptor
In DepthDetails ArticlePubMed
TargetDelta-type opioid receptor(Homo sapiens (Human))
Johnson And Johnson Pharmaceutical Research And Development
Curated by ChEMBL
LigandPNGBDBM50144246(4-{[(1R,5S)-8-Allyl-8-aza-bicyclo[3.2.1]oct-(3E)-y...)
Affinity DataEC50:  177nM. Assay description: Effective concentration against stimulation of [35S]-GTP-gammaS, binding in CHO cells transfected with the human opioid receptor delta 1
In DepthDetails ArticlePubMed