BDBM50144255 CHEMBL65772::N,N-Diethyl-4-[(3-methoxy-phenyl)-(8-phenethyl-8-aza-bicyclo[3.2.1]oct-3-ylidene)-methyl]-benzamide
SMILES [#6]-[#6]-[#7](-[#6]-[#6])-[#6](=O)-c1ccc(cc1)-[#6](=[#6]-1/[#6]-[#6]-2-[#6]-[#6]-[#6](-[#6]-1)-[#7]-2-[#6]-[#6]-c1ccccc1)\c1cccc(-[#8]-[#6])c1
InChI Key InChIKey=BPBXLBMJYVSLOP-UHFFFAOYSA-N
Data  2 KI  1 EC50
  Tab Delimited (TSV)   2D SDfile   Computed 3D by Vconf -m prep SDfile
Find this compound or compounds like it in BindingDB:
Activity Spreadsheet -- Enzyme Inhibition Constant Data from BindingDB
Found 3 hits for monomerid = 50144255
TargetDelta-type opioid receptor(Homo sapiens (Human))
Johnson And Johnson Pharmaceutical Research And Development
Curated by ChEMBL
LigandPNGBDBM50144255(CHEMBL65772 | N,N-Diethyl-4-[(3-methoxy-phenyl)-(8...)
Affinity DataKi:  1.40nM. Assay description: Binding affinity for delta opioid receptor
In DepthDetails ArticlePubMed
TargetMu-type opioid receptor(Homo sapiens (Human))
Johnson And Johnson Pharmaceutical Research And Development
Curated by ChEMBL
LigandPNGBDBM50144255(CHEMBL65772 | N,N-Diethyl-4-[(3-methoxy-phenyl)-(8...)
Affinity DataKi:  417nM. Assay description: Binding affinity for mu opioid receptor
In DepthDetails ArticlePubMed
TargetDelta-type opioid receptor(Homo sapiens (Human))
Johnson And Johnson Pharmaceutical Research And Development
Curated by ChEMBL
LigandPNGBDBM50144255(CHEMBL65772 | N,N-Diethyl-4-[(3-methoxy-phenyl)-(8...)
Affinity DataEC50:  218nM. Assay description: Effective concentration against stimulation of [35S]-GTP-gammaS, binding in CHO cells transfected with the human opioid receptor delta 1
In DepthDetails ArticlePubMed