BDBM50144278 CHEMBL67781::N-tert-Butyl-4-[(8-phenethyl-8-aza-bicyclo[3.2.1]oct-3-ylidene)-phenyl-methyl]-benzamide
SMILES [#6]C([#6])([#6])[#7]-[#6](=O)-c1ccc(cc1)-[#6](=[#6]-1\[#6]-[#6]-2-[#6]-[#6]-[#6](-[#6]-1)-[#7]-2-[#6]-[#6]-c1ccccc1)\c1ccccc1
InChI Key InChIKey=GLAXFVSHHLTFKB-UHFFFAOYSA-N
Data  2 KI
  Tab Delimited (TSV)   2D SDfile   Computed 3D by Vconf -m prep SDfile
Find this compound or compounds like it in BindingDB:
Activity Spreadsheet -- Enzyme Inhibition Constant Data from BindingDB
Found 2 hits for monomerid = 50144278
TargetDelta-type opioid receptor(Homo sapiens (Human))
Johnson And Johnson Pharmaceutical Research And Development
Curated by ChEMBL
LigandPNGBDBM50144278(CHEMBL67781 | N-tert-Butyl-4-[(8-phenethyl-8-aza-b...)
Affinity DataKi:  352nM. Assay description: In vitro binding affinity towards opioid receptor delta 1
In DepthDetails ArticlePubMed
TargetMu-type opioid receptor(Homo sapiens (Human))
Johnson And Johnson Pharmaceutical Research And Development
Curated by ChEMBL
LigandPNGBDBM50144278(CHEMBL67781 | N-tert-Butyl-4-[(8-phenethyl-8-aza-b...)
Affinity DataKi:  608nM. Assay description: In vitro binding affinity towards opioid receptor mu 1
In DepthDetails ArticlePubMed