BDBM50144368 CHEMBL3759372
SMILES CNC(=S)NCc1cc2c(ccc3ccc(OC)cc23)o1
InChI Key InChIKey=DYGPDIAKYPPAMH-UHFFFAOYSA-N
Data  3 KI
  Tab Delimited (TSV)   2D SDfile   Computed 3D by Vconf -m prep SDfile
Find this compound or compounds like it in BindingDB:
Activity Spreadsheet -- Enzyme Inhibition Constant Data from BindingDB
Found 3 hits for monomerid = 50144368
TargetMelatonin receptor type 1B(Homo sapiens (Human))
Universit£
Curated by ChEMBL
LigandPNGBDBM50144368(CHEMBL3759372)
Affinity DataKi:  0.800nM. Assay description: Displacement of 2-[125I]iodomelatonin from human MT2 receptor expressed in CHO cell membranes after 120 mins
In DepthDetails ArticlePubMed
TargetMelatonin receptor type 1A(Homo sapiens (Human))
Universit£
Curated by ChEMBL
LigandPNGBDBM50144368(CHEMBL3759372)
Affinity DataKi:  43nM. Assay description: Displacement of 2-[125I]iodomelatonin from human MT1 receptor expressed in CHO cell membranes after 120 mins
In DepthDetails ArticlePubMed
Target5-hydroxytryptamine receptor 2C(Homo sapiens (Human))
Universit£
Curated by ChEMBL
LigandPNGBDBM50144368(CHEMBL3759372)
Affinity DataKi: >1.00E+4nM. Assay description: Binding affinity to 5-HT2C receptor (unknown origin)
In DepthDetails ArticlePubMed