BDBM50144370 CHEMBL3759661
SMILES CNC(=O)NCc1cc2c(ccc3ccc(OC)cc23)o1
InChI Key InChIKey=RJEAWCKOSGFIHB-UHFFFAOYSA-N
Data  1 KI
  Tab Delimited (TSV)   2D SDfile   Computed 3D by Vconf -m prep SDfile
Find this compound or compounds like it in BindingDB:
Activity Spreadsheet -- Enzyme Inhibition Constant Data from BindingDB
Found 1 hit for monomerid = 50144370
Target5-hydroxytryptamine receptor 2C(Homo sapiens (Human))
Universit£
Curated by ChEMBL
LigandPNGBDBM50144370(CHEMBL3759661)
Affinity DataKi: >1.00E+4nM. Assay description: Binding affinity to 5-HT2C receptor (unknown origin)
In DepthDetails ArticlePubMed