BDBM50144375 CHEMBL3759908
SMILES OC(=O)c1cc2CCc3c(F)c(F)ccc3-c2s1
InChI Key InChIKey=XKZPOWJSECOGIV-UHFFFAOYSA-N
Data  2 EC50
  Tab Delimited (TSV)   2D SDfile   Computed 3D by Vconf -m prep SDfile
Find this compound or compounds like it in BindingDB:
Activity Spreadsheet -- Enzyme Inhibition Constant Data from BindingDB
Found 2 hits for monomerid = 50144375
TargetPalmitoleoyl-protein carboxylesterase NOTUM(Homo sapiens (Human))
Lexicon Pharmaceuticals
Curated by ChEMBL
LigandPNGBDBM50144375(CHEMBL3759908)
Affinity DataEC50:  61nM. Assay description: Inhibition of human notum pectinacetylesterase expressed in 293F cells by TCF/LEF CellSensor assay
In DepthDetails ArticlePubMed
TargetPalmitoleoyl-protein carboxylesterase NOTUM(Mus musculus)
Lexicon Pharmaceuticals
Curated by ChEMBL
LigandPNGBDBM50144375(CHEMBL3759908)
Affinity DataEC50:  17nM. Assay description: Inhibition of mouse notum pectinacetylesterase expressed in 293F cells by TCF/LEF CellSensor assay
In DepthDetails ArticlePubMed