BDBM50144670 CHEMBL3759349
SMILES COc1ccc(cc1)C(=O)Nc1ncc(s1)-c1ccc(cc1OCc1ccccc1C#N)C(O)=O
InChI Key InChIKey=ZJOVVEKDDFSBNJ-UHFFFAOYSA-N
Data  2 IC50
  Tab Delimited (TSV)   2D SDfile   Computed 3D by Vconf -m prep SDfile
Find this compound or compounds like it in BindingDB:
Activity Spreadsheet -- Enzyme Inhibition Constant Data from BindingDB
Found 2 hits for monomerid = 50144670
TargetCasein kinase II subunit alpha'(Homo sapiens (Human))
Kyoto University
Curated by ChEMBL
LigandPNGBDBM50144670(CHEMBL3759349)
Affinity DataIC50:  11nM. Assay description: Inhibition of GST-tagged human CK2alpha' (1 to 350 residues) using CK2tide as substrate incubated for 1 hr by off-chip mobility shift assay
In DepthDetails ArticlePubMed
TargetCasein kinase II subunit alpha(Homo sapiens (Human))
Kyoto University
Curated by ChEMBL
LigandPNGBDBM50144670(CHEMBL3759349)
Affinity DataIC50:  16nM. Assay description: Inhibition of GST-tagged human CK2alpha (1 to 391 residues) using CK2tide as substrate incubated for 1 hr by off-chip mobility shift assay
In DepthDetails ArticlePubMed