BDBM50144682 CHEMBL3759512
SMILES COc1ccc(cc1)C(=O)Nc1ncc(s1)-c1ccc(cc1OCc1ccccc1Cl)C(O)=O
InChI Key InChIKey=YYRKEFXZSFWXFC-UHFFFAOYSA-N
Data  2 IC50
  Tab Delimited (TSV)   2D SDfile   Computed 3D by Vconf -m prep SDfile
Find this compound or compounds like it in BindingDB:
Activity Spreadsheet -- Enzyme Inhibition Constant Data from BindingDB
Found 2 hits for monomerid = 50144682
TargetCasein kinase II subunit alpha'(Homo sapiens (Human))
Kyoto University
Curated by ChEMBL
LigandPNGBDBM50144682(CHEMBL3759512)
Affinity DataIC50:  9.80nM. Assay description: Inhibition of GST-tagged human CK2alpha' (1 to 350 residues) using CK2tide as substrate incubated for 1 hr by off-chip mobility shift assay
In DepthDetails ArticlePubMed
TargetCasein kinase II subunit alpha(Homo sapiens (Human))
Kyoto University
Curated by ChEMBL
LigandPNGBDBM50144682(CHEMBL3759512)
Affinity DataIC50:  16nM. Assay description: Inhibition of GST-tagged human CK2alpha (1 to 391 residues) using CK2tide as substrate incubated for 1 hr by off-chip mobility shift assay
In DepthDetails ArticlePubMed