BDBM50144815 2,3,5,6-Tetrafluoro-N-(2-sulfamoyl-phenyl)-benzamide::CHEMBL75747
SMILES NS(=O)(=O)c1ccccc1NC(=O)c1c(F)c(F)cc(F)c1F
InChI Key InChIKey=OTOKUJHGGBIYJX-UHFFFAOYSA-N
Data  6 KI
  Tab Delimited (TSV)   2D SDfile   Computed 3D by Vconf -m prep SDfile
Find this compound or compounds like it in BindingDB:
Activity Spreadsheet -- Enzyme Inhibition Constant Data from BindingDB
Found 6 hits for monomerid = 50144815
TargetCarbonic anhydrase 9(Homo sapiens (Human))
Universit£
Curated by ChEMBL
LigandPNGBDBM50144815(2,3,5,6-Tetrafluoro-N-(2-sulfamoyl-phenyl)-benzami...)
Affinity DataKi:  9.5nM. Assay description: Inhibitory activity against human carbonic anhydrase IX
In DepthDetails ArticlePubMed
TargetCarbonic anhydrase 2(Homo sapiens (Human))
Universit£
Curated by ChEMBL
LigandPNGBDBM50144815(2,3,5,6-Tetrafluoro-N-(2-sulfamoyl-phenyl)-benzami...)
Affinity DataKi:  38nM. Assay description: Inhibitory activity against human carbonic anhydrase II
In DepthDetails ArticlePubMed
TargetCarbonic anhydrase 2(Homo sapiens (Human))
Universit£
Curated by ChEMBL
LigandPNGBDBM50144815(2,3,5,6-Tetrafluoro-N-(2-sulfamoyl-phenyl)-benzami...)
Affinity DataKi:  38nM. Assay description: In vitro inhibitory activity against human carbonic anhydrase II (hCAII)
In DepthDetails ArticlePubMed
TargetCarbonic anhydrase 4(Bos taurus (bovine))
Universit£
Curated by ChEMBL
LigandPNGBDBM50144815(2,3,5,6-Tetrafluoro-N-(2-sulfamoyl-phenyl)-benzami...)
Affinity DataKi:  690nM. Assay description: In vitro inhibitory activity against bovine carbonic anhydrase IV (CAIV)
In DepthDetails ArticlePubMed
TargetCarbonic anhydrase 1(Homo sapiens (Human))
Universit£
Curated by ChEMBL
LigandPNGBDBM50144815(2,3,5,6-Tetrafluoro-N-(2-sulfamoyl-phenyl)-benzami...)
Affinity DataKi:  1.50E+3nM. Assay description: In vitro inhibitory activity against human carbonic anhydrase I (hCAI)
In DepthDetails ArticlePubMed
TargetCarbonic anhydrase 1(Homo sapiens (Human))
Universit£
Curated by ChEMBL
LigandPNGBDBM50144815(2,3,5,6-Tetrafluoro-N-(2-sulfamoyl-phenyl)-benzami...)
Affinity DataKi:  1.50E+3nM. Assay description: Inhibitory activity against human carbonic anhydrase I
In DepthDetails ArticlePubMed