BDBM50144907 CHEMBL3763549
SMILES CCOC(=O)C(CC)Cc1ccc(cc1)C(=O)NCc1ccccc1Cl
InChI Key InChIKey=NPOMDQNTYQQTNG-UHFFFAOYSA-N
Data  1 IC50
  Tab Delimited (TSV)   2D SDfile   Computed 3D by Vconf -m prep SDfile
Find this compound or compounds like it in BindingDB:
Activity Spreadsheet -- Enzyme Inhibition Constant Data from BindingDB
Found 1 hit for monomerid = 50144907
TargetBifunctional epoxide hydrolase 2(Homo sapiens (Human))
Goethe-University Frankfurt
Curated by ChEMBL
LigandPNGBDBM50144907(CHEMBL3763549)
Affinity DataIC50:  3.80E+3nM. Assay description: Inhibition of human recombinant sEH using PHOME as substrate preincubated for 30 mins followed by substrate addition measured for 30 mins by fluoresc...
In DepthDetails ArticlePubMed