BDBM50144922 CHEMBL3765787
SMILES CC(C)C[C@H](NC(=O)Nc1ccc(C)cc1C)C(=O)NO
InChI Key InChIKey=NCRKWMXPKPAAQF-ZDUSSCGKSA-N
Data  2 IC50
  Tab Delimited (TSV)   2D SDfile   Computed 3D by Vconf -m prep SDfile
Find this compound or compounds like it in BindingDB:
Activity Spreadsheet -- Enzyme Inhibition Constant Data from BindingDB
Found 2 hits for monomerid = 50144922
TargetHistone deacetylase (HDAC1 and HDAC2)(Homo sapiens (Human))
Fudan University
Curated by ChEMBL
LigandPNGBDBM50144922(CHEMBL3765787)
Affinity DataIC50: >1.00E+5nM. Assay description: Inhibition of HDAC1/HDAC2 in human HeLa cells nuclear extract preincubated for 5 mins before Boc-Lys (acetyl)-AMC substrate addition for 30 mins by m...
In DepthDetails ArticlePubMed
TargetAminopeptidase N(Sus scrofa (Pig))
Fudan University
Curated by ChEMBL
LigandPNGBDBM50144922(CHEMBL3765787)
Affinity DataIC50:  180nM. Assay description: Inhibition of APN in porcine kidney microsomes preincubated for 5 mins before L-leu-p-nitroanilide substrate addition for 30 mins by plate reader ana...
In DepthDetails ArticlePubMed