BDBM50145097 CHEMBL3764829
SMILES CN1CCN(Cc2ccc(cc2)C2Nc3cccc4c3c(n[nH]c4=O)C2c2ccccc2)CC1
InChI Key InChIKey=IBTSZGGZYOHTBG-UHFFFAOYSA-N
Data  1 IC50  1 EC50
  Tab Delimited (TSV)   2D SDfile   Computed 3D by Vconf -m prep SDfile
Find this compound or compounds like it in BindingDB:
Activity Spreadsheet -- Enzyme Inhibition Constant Data from BindingDB
Found 2 hits for monomerid = 50145097
TargetPoly [ADP-ribose] polymerase 1(Homo sapiens (Human))
Biomarin Pharmaceutical
Curated by ChEMBL
LigandPNGBDBM50145097(CHEMBL3764829)
Affinity DataEC50:  41nM. Assay description: Inhibition of PARP in human LoVo cells assessed as inhibition of poly(ADP)-ribose polymerization for 30 mins by fluorescence assay
In DepthDetails ArticlePubMed
TargetPoly [ADP-ribose] polymerase 1(Homo sapiens (Human))
Biomarin Pharmaceutical
Curated by ChEMBL
LigandPNGBDBM50145097(CHEMBL3764829)
Affinity DataIC50:  2nM. Assay description: Inhibition of human PARP1 using [3H]NAD as substrate after 1 min by microplate scintillation counting analysis
In DepthDetails ArticlePubMed