BDBM50145126 (2S)-2-{[(2R)-1-{[(4S,7R,10S,13R,16S)-13-benzyl-7-(carbamoylmethyl)-16-[(4-hydroxyphenyl)methyl]-10-(2-methylpropyl)-6,9,12,15,18-pentaoxo-1,2-dithia-5,8,11,14,17-pentaazacycloicosan-4-yl]carbonyl}pyrrolidin-2-yl]formamido}-N-(carbamoylmethyl)-5-[(diaminomethylidene)amino]pentanamide::CHEMBL268306
SMILES CC(C)C[C@@H]1NC(=O)[C@@H](Cc2ccccc2)NC(=O)[C@H](Cc2ccc(O)cc2)NC(=O)CCSSC[C@@H](NC(=O)[C@@H](CC(N)=O)NC1=O)C(=O)N1CCC[C@@H]1C(=O)N[C@@H](CCCNC(N)=N)C(=O)NCC(N)=O
InChI Key InChIKey=CYOLRNSRVHAZDY-XYFYQEOVSA-N
Data  4 KI
  Tab Delimited (TSV)   2D SDfile   Computed 3D by Vconf -m prep SDfile
Find this compound or compounds like it in BindingDB:
Activity Spreadsheet -- Enzyme Inhibition Constant Data from BindingDB
Found 4 hits for monomerid = 50145126
TargetVasopressin V1b receptor(Homo sapiens (Human))
Medical College Of Ohio
Curated by ChEMBL
LigandPNGBDBM50145126((2S)-2-{[(2R)-1-{[(4S,7R,10S,13R,16S)-13-benzyl-7-...)
Affinity DataKi:  0.230nM. Assay description: Binding affinity against human vasopressin V1b receptor was determined by using plasma membranes from CHO cells stably transfected with VP/OT recepto...
In DepthDetails ArticlePubMed
TargetVasopressin V1a receptor(Homo sapiens (Human))
Medical College Of Ohio
Curated by ChEMBL
LigandPNGBDBM50145126((2S)-2-{[(2R)-1-{[(4S,7R,10S,13R,16S)-13-benzyl-7-...)
Affinity DataKi:  44.1nM. Assay description: Binding affinity against human vasopressin V1a receptor was determined by using plasma membranes from CHO cells stably transfected with VP/OT recepto...
In DepthDetails ArticlePubMed
TargetOxytocin receptor(Homo sapiens (Human))
Medical College Of Ohio
Curated by ChEMBL
LigandPNGBDBM50145126((2S)-2-{[(2R)-1-{[(4S,7R,10S,13R,16S)-13-benzyl-7-...)
Affinity DataKi:  211nM. Assay description: Binding affinity against human oxytocin receptor was determined by using plasma membranes from CHO cells stably transfected with VP/OT receptors
In DepthDetails ArticlePubMed
TargetVasopressin V2 receptor(Homo sapiens (Human))
Medical College Of Ohio
Curated by ChEMBL
LigandPNGBDBM50145126((2S)-2-{[(2R)-1-{[(4S,7R,10S,13R,16S)-13-benzyl-7-...)
Affinity DataKi:  245nM. Assay description: Binding affinity against human vasopressin V2 receptor was determined by using plasma membranes from CHO cells stably transfected with VP/OT receptor...
In DepthDetails ArticlePubMed