BDBM50145171 CHEMBL3765460
SMILES OCCNc1ccc2nnnc(Nc3cccc(OC(F)(F)F)c3)c2n1
InChI Key InChIKey=FEORYXHUFPDGRC-UHFFFAOYSA-N
Data  1 IC50
  Tab Delimited (TSV)   2D SDfile   Computed 3D by Vconf -m prep SDfile
Find this compound or compounds like it in BindingDB:
Activity Spreadsheet -- Enzyme Inhibition Constant Data from BindingDB
Found 1 hit for monomerid = 50145171
TargetSerine/threonine-protein kinase pim-1(Homo sapiens (Human))
Shenyang Pharmaceutical University
Curated by ChEMBL
LigandPNGBDBM50145171(CHEMBL3765460)
Affinity DataIC50:  2.10E+3nM. Assay description: Inhibition of CDK2/Cyclin E (unknown origin) expressed in baculoviral infected insect Sf9 cells using histone H1 as substrate in presence of [gamma-3...
In DepthDetails ArticlePubMed