BDBM50145187 CHEMBL3763533
SMILES CC(C)[C@H]1COC(=O)N1C(=O)[C@@H](C)[C@H](O)C1=CCCCC1
InChI Key InChIKey=VKUFVKYLFZVBDA-YUTCNCBUSA-N
Data  1 IC50
  Tab Delimited (TSV)   2D SDfile   Computed 3D by Vconf -m prep SDfile
Find this compound or compounds like it in BindingDB:
Activity Spreadsheet -- Enzyme Inhibition Constant Data from BindingDB
Found 1 hit for monomerid = 50145187
TargetInterleukin-6 receptor subunit beta(Homo sapiens (Human))
Dongguk University-Seoul
Curated by ChEMBL
LigandPNGBDBM50145187(CHEMBL3763533)
Affinity DataIC50: >2.00E+4nM. Assay description: Inhibition of CDK2/Cyclin E (unknown origin) expressed in baculoviral infected insect Sf9 cells using histone H1 as substrate in presence of [gamma-3...
In DepthDetails ArticlePubMed