BDBM50145217 2-(4-Morpholin-4-ylmethyl-phenyl)-1H-benzoimidazole-4-carboxylic acid amide::CHEMBL432166
SMILES NC(=O)c1cccc2[nH]c(nc12)-c1ccc(CN2CCOCC2)cc1
InChI Key InChIKey=UPZUGQSKDPPDCM-UHFFFAOYSA-N
Data  1 KI
  Tab Delimited (TSV)   2D SDfile   Computed 3D by Vconf -m prep SDfile
Find this compound or compounds like it in BindingDB:
Activity Spreadsheet -- Enzyme Inhibition Constant Data from BindingDB
Found 1 hit for monomerid = 50145217
TargetPoly [ADP-ribose] polymerase 1(Homo sapiens (Human))
University Of Newcastle
Curated by ChEMBL
LigandPNGBDBM50145217(2-(4-Morpholin-4-ylmethyl-phenyl)-1H-benzoimidazol...)
Affinity DataKi:  12nM. Assay description: Binding affinity towards human poly(ADP-ribose) polymerase-1 (PARP-1)
In DepthDetails ArticlePubMed