BDBM50145634 CHEMBL3764999
SMILES Cc1ccn(n1)-c1cc(Cl)ccc1[C@@H](Oc1cc(nc(N)n1)N1CCC2(CN[C@@H](C2)C(O)=O)CC1)C(F)(F)F
InChI Key InChIKey=VRJIAKOJJZKDHH-LAUBAEHRSA-N
Data  2 IC50
  Tab Delimited (TSV)   2D SDfile   Computed 3D by Vconf -m prep SDfile
Find this compound or compounds like it in BindingDB:
Activity Spreadsheet -- Enzyme Inhibition Constant Data from BindingDB
Found 2 hits for monomerid = 50145634
TargetTryptophan 5-hydroxylase 1(Homo sapiens (Human))
Karos Pharmaceuticals
Curated by ChEMBL
LigandPNGBDBM50145634(CHEMBL3764999)
Affinity DataIC50:  26nM. Assay description: Inhibition of TPH1 (unknown origin)
In DepthDetails ArticlePubMed
TargetTryptophan 5-hydroxylase 1(Homo sapiens (Human))
Karos Pharmaceuticals
Curated by ChEMBL
LigandPNGBDBM50145634(CHEMBL3764999)
Affinity DataIC50:  26nM. Assay description: Inhibition of TPH1 (unknown origin)
In DepthDetails ArticlePubMed