BDBM50145716 2-{4-[2-(5-Methyl-2-phenyl-oxazol-4-yl)-ethoxy]-benzyl}-2-phenoxy-butyric acid::CHEMBL78529
SMILES CCC(Cc1ccc(OCCc2nc(oc2C)-c2ccccc2)cc1)(Oc1ccccc1)C(O)=O
InChI Key InChIKey=PWZALNZYZAMBJL-UHFFFAOYSA-N
Data  3 IC50  2 EC50
  Tab Delimited (TSV)   2D SDfile   Computed 3D by Vconf -m prep SDfile
Find this compound or compounds like it in BindingDB:
Activity Spreadsheet -- Enzyme Inhibition Constant Data from BindingDB
Found 5 hits for monomerid = 50145716
TargetPeroxisome proliferator-activated receptor delta(Homo sapiens (Human))
Eli Lilly
Curated by ChEMBL
LigandPNGBDBM50145716(2-{4-[2-(5-Methyl-2-phenyl-oxazol-4-yl)-ethoxy]-be...)
Affinity DataIC50:  5.07E+3nM. Assay description: Displacement of PPARalpha/delta agonist from human Peroxisome proliferator activated receptor delta
In DepthDetails ArticlePubMed
TargetPeroxisome proliferator-activated receptor gamma(Homo sapiens (Human))
Eli Lilly
Curated by ChEMBL
LigandPNGBDBM50145716(2-{4-[2-(5-Methyl-2-phenyl-oxazol-4-yl)-ethoxy]-be...)
Affinity DataEC50:  285nM. Assay description: Transcriptional activation of reporter assay by PPAR gamma receptor in CV-1 cells
In DepthDetails ArticlePubMed
TargetPeroxisome proliferator-activated receptor gamma(Homo sapiens (Human))
Eli Lilly
Curated by ChEMBL
LigandPNGBDBM50145716(2-{4-[2-(5-Methyl-2-phenyl-oxazol-4-yl)-ethoxy]-be...)
Affinity DataIC50:  290nM. Assay description: Displacement of PPARgamma agonist from human PPAR gamma receptor
In DepthDetails ArticlePubMed
TargetPeroxisome proliferator-activated receptor alpha(Homo sapiens (Human))
Eli Lilly
Curated by ChEMBL
LigandPNGBDBM50145716(2-{4-[2-(5-Methyl-2-phenyl-oxazol-4-yl)-ethoxy]-be...)
Affinity DataEC50:  75nM. Assay description: Transcriptional activation of reporter assay by human Peroxisome proliferator activated receptor alpha in CV-1 cells
In DepthDetails ArticlePubMed
TargetPeroxisome proliferator-activated receptor alpha(Homo sapiens (Human))
Eli Lilly
Curated by ChEMBL
LigandPNGBDBM50145716(2-{4-[2-(5-Methyl-2-phenyl-oxazol-4-yl)-ethoxy]-be...)
Affinity DataIC50:  473nM. Assay description: Displacement of PPARalpha/delta agonist from human Peroxisome proliferator activated receptor alpha
In DepthDetails ArticlePubMed