BDBM50145898 CHEMBL3763162
SMILES C[S+]([O-])c1ccc(cc1Cl)C(CC1CCCC1)c1cc2cccnc2[nH]1
InChI Key InChIKey=RHDVACHZZPTRQB-UHFFFAOYSA-N
Data  3 EC50
  Tab Delimited (TSV)   2D SDfile   Computed 3D by Vconf -m prep SDfile
Find this compound or compounds like it in BindingDB:
Activity Spreadsheet -- Enzyme Inhibition Constant Data from BindingDB
Found 3 hits for monomerid = 50145898
TargetHexokinase-4(Homo sapiens (Human))
Servier Research Institute Of Medicinal Chemistry
Curated by ChEMBL
LigandPNGBDBM50145898(CHEMBL3763162)
Affinity DataEC50:  1.15E+3nM. Assay description: Activation of recombinant human glucokinase assessed as NADPH formation using glucose as substrate incubated for 30 mins in presence of NADP+ and glu...
In DepthDetails ArticlePubMed
TargetHexokinase-4(Homo sapiens (Human))
Servier Research Institute Of Medicinal Chemistry
Curated by ChEMBL
LigandPNGBDBM50145898(CHEMBL3763162)
Affinity DataEC50:  1.10E+3nM. Assay description: Activation of recombinant human glucokinase assessed as NADPH formation using glucose as substrate incubated for 30 mins in presence of NADP+ and glu...
In DepthDetails ArticlePubMed
TargetHexokinase-4(Homo sapiens (Human))
Servier Research Institute Of Medicinal Chemistry
Curated by ChEMBL
LigandPNGBDBM50145898(CHEMBL3763162)
Affinity DataEC50:  1.10E+3nM. Assay description: Activation of recombinant human glucokinase assessed as NADPH formation using glucose as substrate incubated for 30 mins in presence of NADP+ and glu...
In DepthDetails ArticlePubMed