BDBM50145968 1-[4-(2-Ethyl-5,7-dimethyl-imidazo[4,5-b]pyridin-3-ylmethyl)-phenyl]-naphthalene-2-carboxylic acid::CHEMBL541212
SMILES CCc1nc2c(C)cc(C)nc2n1Cc1ccc(cc1)-c1c(ccc2ccccc12)C(O)=O
InChI Key InChIKey=RINNNBLMNUIQHK-UHFFFAOYSA-N
Data  1 IC50
  Tab Delimited (TSV)   2D SDfile   Computed 3D by Vconf -m prep SDfile
Find this compound or compounds like it in BindingDB:
Activity Spreadsheet -- Enzyme Inhibition Constant Data from BindingDB
Found 1 hit for monomerid = 50145968
TargetType-1 angiotensin II receptor B(RAT)
Università
Curated by ChEMBL
LigandPNGBDBM50145968(1-[4-(2-Ethyl-5,7-dimethyl-imidazo[4,5-b]pyridin-3...)
Affinity DataIC50:  33nM. Assay description: Binding affinity for rat angiotensin II receptor, type 1
In DepthDetails ArticlePubMed