BDBM50145977 2-Chloro-4-[4-(5,7-dimethyl-2-propyl-imidazo[4,5-b]pyridin-3-ylmethyl)-phenyl]-quinoline-3-carboxylic acid::2-chloro-4-(4-((5,7-dimethyl-2-propyl-3H-imidazo[4,5-b]pyridin-3-yl)methyl)phenyl)quinoline-3-carboxylic acid::CHEMBL314315
SMILES CCCc1nc2c(C)cc(C)nc2n1Cc1ccc(cc1)-c1c(C(O)=O)c(Cl)nc2ccccc12
InChI Key InChIKey=CPPCOUAVKSXREI-UHFFFAOYSA-N
Data  1 IC50
  Tab Delimited (TSV)   2D SDfile   Computed 3D by Vconf -m prep SDfile
Find this compound or compounds like it in BindingDB:
Activity Spreadsheet -- Enzyme Inhibition Constant Data from BindingDB
Found 1 hit for monomerid = 50145977
TargetType-1 angiotensin II receptor B(RAT)
Università
Curated by ChEMBL
LigandPNGBDBM50145977(2-Chloro-4-[4-(5,7-dimethyl-2-propyl-imidazo[4,5-b...)
Affinity DataIC50:  7.70nM. Assay description: Binding affinity for rat angiotensin II receptor, type 1
In DepthDetails ArticlePubMed