BDBM50145981 4-(4-((5,7-dimethyl-2-propyl-3H-imidazo[4,5-b]pyridin-3-yl)methyl)phenyl)-2-methylquinoline-3-carboxylic acid::4-[4-(5,7-Dimethyl-2-propyl-imidazo[4,5-b]pyridin-3-ylmethyl)-phenyl]-2-methyl-quinoline-3-carboxylic acid::CHEMBL84573
SMILES CCCc1nc2c(C)cc(C)nc2n1Cc1ccc(cc1)-c1c(C(O)=O)c(C)nc2ccccc12
InChI Key InChIKey=YBVMIUSZGJGLEL-UHFFFAOYSA-N
Data  2 IC50
  Tab Delimited (TSV)   2D SDfile   Computed 3D by Vconf -m prep SDfile
Find this compound or compounds like it in BindingDB:
Activity Spreadsheet -- Enzyme Inhibition Constant Data from BindingDB
Found 2 hits for monomerid = 50145981
TargetType-1 angiotensin II receptor(RABBIT)
Università
Curated by ChEMBL
LigandPNGBDBM50145981(4-(4-((5,7-dimethyl-2-propyl-3H-imidazo[4,5-b]pyri...)
Affinity DataIC50:  13nM. Assay description: Antagonist activity against AT1 receptor assessed as inhibition of Ang2-induced rabit aortic strip contraction
In DepthDetails ArticlePubMed
TargetType-1 angiotensin II receptor B(RAT)
Università
Curated by ChEMBL
LigandPNGBDBM50145981(4-(4-((5,7-dimethyl-2-propyl-3H-imidazo[4,5-b]pyri...)
Affinity DataIC50:  9nM. Assay description: Binding affinity for rat angiotensin II receptor, type 1
In DepthDetails ArticlePubMed