BDBM50146316 CHEMBL3765187
SMILES CCCC(=O)Nc1ccc2CCc3ccccc3N(C(=O)CN(CC)CC)c2c1
InChI Key InChIKey=PNWNDCACOFFVKM-UHFFFAOYSA-N
Data  1 IC50
  Tab Delimited (TSV)   2D SDfile   Computed 3D by Vconf -m prep SDfile
Find this compound or compounds like it in BindingDB:
Activity Spreadsheet -- Enzyme Inhibition Constant Data from BindingDB
Found 1 hit for monomerid = 50146316
TargetNuclear receptor subfamily 1 group I member 3(Homo sapiens (Human))
St. Jude Children'S Research Hospital
Curated by ChEMBL
LigandPNGBDBM50146316(CHEMBL3765187)
Affinity DataIC50:  2.32E+3nM. Assay description: Inverse agonist activity at GST tagged-human CAR-LBD assessed as reduction in fluorescein-PGC1 alpha coactivator recruitment after 1 hr by TR-FRET as...
In DepthDetails ArticlePubMed