BDBM50146503 (3R,3aS)-3-{4-[3-(3-Fluoro-phenyl)-allyl]-piperazin-1-ylmethyl}-7,8-dimethoxy-3a,4-dihydro-3H-chromeno[4,3-c]isoxazole::CHEMBL95218
SMILES COc1cc2OC[C@H]3[C@H](CN4CCN(C\C=C\c5cccc(F)c5)CC4)ON=C3c2cc1OC
InChI Key InChIKey=WNCGPEYSCDVJNB-UHRPABQZSA-N
Data  3 KI
  Tab Delimited (TSV)   2D SDfile   Computed 3D by Vconf -m prep SDfile
Find this compound or compounds like it in BindingDB:
Activity Spreadsheet -- Enzyme Inhibition Constant Data from BindingDB
Found 3 hits for monomerid = 50146503
TargetAlpha-2C adrenergic receptor(Homo sapiens (Human))
Janssen-Cilag
Curated by ChEMBL
LigandPNGBDBM50146503((3R,3aS)-3-{4-[3-(3-Fluoro-phenyl)-allyl]-piperazi...)
Affinity DataKi:  0.700nM. Assay description: In vitro binding affinity to human alpha-2C adrenergic receptor
In DepthDetails ArticlePubMed
TargetSodium-dependent serotonin transporter(Homo sapiens (Human))
Janssen-Cilag
Curated by ChEMBL
LigandPNGBDBM50146503((3R,3aS)-3-{4-[3-(3-Fluoro-phenyl)-allyl]-piperazi...)
Affinity DataKi:  2.5nM. Assay description: In vitro binding affinity towards human serotonin transporter
In DepthDetails ArticlePubMed
TargetAlpha-2A adrenergic receptor(Homo sapiens (Human))
Janssen-Cilag
Curated by ChEMBL
LigandPNGBDBM50146503((3R,3aS)-3-{4-[3-(3-Fluoro-phenyl)-allyl]-piperazi...)
Affinity DataKi:  5.90nM. Assay description: In vitro binding affinity to the human alpha-2A adrenergic receptor
In DepthDetails ArticlePubMed